OntoPavese
type: Ontology
version IRI: https://digitalpavese.cnr.it/ontology/OntoPavese/2.0.1
imports: lrmoo
imports: http://www.cidoc-crm.org/cidoc-crm/7.1.3/
imports: https://www.ica.org/standards/RiC/ontology/1.1
license: Creative Commons BY-NC 4.0 http://creativecommons.org/licenses/by-nc/4.0/
creator: Daria Spampinato
creator: Giovanni Gafà
creator: Giuseppe Arena
creator: Salvatore Cristofaro
version info: 2.0.1

Cites
type: ObjectProperty
sub property of: Mentions
inverse of: is Cited In
domain: Class
  union of: Edtion
  union of: OP Expression
  union of: Part Of Edition
  union of: Production
range: Class
  union of: Edtion
  union of: OP Expression
  union of: Part Of Edition
  union of: Production
comment: Indica che una certa opera cita un passo di un'altra.
research results label: Cita

Date Specifics Of
type: ObjectProperty
inverse of: has Date Specifics
domain: Thing
range: Date
comment: Inversa di hasDateSpecifics.
research results label: Componenti della Data di

Mentions
type: ObjectProperty
inverse of: is Mentioned In
domain: Class
  union of: Edtion
  union of: OP Expression
  union of: Part Of Edition
  union of: Production
range: Class
  union of: Edtion
  union of: OP Expression
  union of: Part Of Edition
  union of: Production
comment: Indica che una certa opera ne menziona un'altra (per esempio citandone il titolo o una sua parte).
research results label: Menziona

OP has Expression Used In Work
type: ObjectProperty
sub property of: R74i has expression used in
inverse of: OP uses Expression Of Work
domain: Production
range: Production
comment: Inversa di OP_usesExpressionOfWork.
research results label: ha Testi Inclusi nell'Opera

OP has Instantiation
type: ObjectProperty
sub property of: hasOrHadInstantiation
inverse of: OP isInstantiationOf
type: AsymmetricProperty
type: IrreflexiveProperty
domain: Class
  union of: Symbolic Page Fragment
  union of: Witness
range: Class
  union of: Physical Draft
  union of: Physical Page
comment: Indica che il contenuto intellettuale di un certo ExpressionDraft è stato istanziato in un PhysicalDraft.
research results label: è Istanziazione di

OP incorporates
type: ObjectProperty
sub property of: R75 incorporates
inverse of: OP is Incorporated In
domain: OP Expression
range: OP Expression
comment: Questa proprietà associa un'istanza di OP_Expression a una seconda istanza di OP_Expression che è parte integrale della prima. Le due OP_Expression, però, sono realizzazioni di (isExpressionOf) due Production diverse.
research results label: Include

OP is Incorporated In
type: ObjectProperty
sub property of: R75i is incorporated in
domain: OP Expression
range: OP Expression
comment: Inversa di OP_incorporates.
research results label: è Incluso in

OP uses Expression Of Work
type: ObjectProperty
sub property of: R74 uses expression of
domain: Production
range: Production
comment: Questa proprietà associa un'istanza di Production con una seconda istanza di Production, nel caso in cui tutte le espressioni della prima contengano qualche espressione della seconda. Questa proprietà rappresenta la generalizzazione al livello delle Production della proprietà OP_incorporates riguardante il livello delle OP_Expression.
research results label: include Testi dell'Opera

Publish
type: ObjectProperty
inverse of: is Published By
type: AsymmetricProperty
type: IrreflexiveProperty
domain: Class
  union of: Periodical
  union of: Publishing House
range: Edtion
comment: Indica che un certo Periodical o una PublishingHouse pubblicano una certa Edition.
research results label: Pubblica

has Archive Part
type: ObjectProperty
sub property of: has Part
sub property of: hasPartTransitive
inverse of: is Archive Part Of
domain: RecordResource
range: RecordResource
comment: Indica la relazione tutto-parte fra i diversi elementi di un fondo archivistico.
research results label: ha Parte Archivistica

has Author
type: ObjectProperty
inverse of: is Author Of
type: AsymmetricProperty
type: IrreflexiveProperty
domain: Class
  union of: Edtion
  union of: OP Expression
  union of: Part Of Edition
  union of: Production
range: Author
comment: Indica l'Author di una Production, OP_Expression, PartOfEdition o Edition.
research results label: ha Autore

has Back
type: ObjectProperty
type: SymmetricProperty
type: IrreflexiveProperty
domain: Physical Page
range: Physical Page
comment: Indica il retro di una PhysicalPage (ogni PhysicalPage è il retro di una e una sola altra pagina). NB: L'indicazione se si tratti di quanto indicato come recto o verso del foglio si trova invece nella proprietà dati hasPageNumber.
research results label: ha Retro

has Creation Date From
type: ObjectProperty
sub property of: has Date
inverse of: is Creation Date From Of
type: FunctionalProperty
domain: Class
  union of: Edtion
  union of: OP Expression
  union of: Production
range: Date
comment: Indica la Date che è l'inizio dell'intervallo in cui è stata creata una Production, una sua OP_Expression (per esempio un ExpressionDraft, una Translation, o più generalmente una certa forma che l'opera ha assunto) o ancora un'Edition.
research results label: ha Data di Creazione da

has Creation Date To
type: ObjectProperty
sub property of: has Date
inverse of: is Creation Date To Of
type: FunctionalProperty
domain: Class
  union of: Edtion
  union of: OP Expression
  union of: Production
range: Date
comment: Indica la Date che è la fine dell'intervallo in cui è stata creata una Production, una sua OP_Expression (per esempio un ExpressionDraft, una Translation, o più generalmente una certa forma che l'opera ha assunto) o ancora un'Edition.
research results label: ha Data di Creazione fino a

has Creation Place
type: ObjectProperty
inverse of: is Creation Place Of
type: AsymmetricProperty
type: IrreflexiveProperty
domain: Class
  union of: Edtion
  union of: OP Expression
  union of: Production
range: Real Place
comment: Indica il RealPlace nel quale viene creata una Production o una OP_Expression, o ancora in cui è pubblicata una Edition, secondo i dati bibliografici.
research results label: ha Luogo di Creazione

has Date
type: ObjectProperty
inverse of: is Date Of
type: AsymmetricProperty
type: IrreflexiveProperty
domain: Thing
range: Date
comment: Indica una Date generica.
research results label: ha Data

has Date Specifics
type: ObjectProperty
type: AsymmetricProperty
type: IrreflexiveProperty
domain: Date
comment: Proprietà di servizio che raccoglie le proprietà oggetto di Date.
research results label: ha Componenti della Data

has Day
type: ObjectProperty
sub property of: has Date Specifics
inverse of: is Day Of
type: FunctionalProperty
domain: Date
range: Day
comment: Collega la Date di un certo evento con il Day in cui l'evento si è realizzato.
research results label: ha Giorno

has Digital Edition
type: ObjectProperty
inverse of: is Digital Edition Of
domain: OP Expression
range: Digital Edition
comment: Indica l'edizione digitale di riferimento.
research results label: ha Editione Digitale

has Editor
type: ObjectProperty
inverse of: is Editor Of
type: AsymmetricProperty
type: IrreflexiveProperty
domain: Edtion
range: Real Person
comment: Indica la RealPerson curatrice di una certa Edition.
research results label: ha Curatore

has Expression
type: ObjectProperty
sub property of: R3 is realised in
inverse of: is Expression Of
domain: Production
range: OP Expression
comment: Indica che una Production ha trovato espressione in una certa OP_Expression.
research results label: ha Redazione

has Family Member
type: ObjectProperty
inverse of: is Family Member Of
type: SymmetricProperty
type: IrreflexiveProperty
domain: Family Member
range: Family Member
comment: Indica un FamilyMember di una RealPerson.
research results label: ha Familiare

has HeadQuarters In
type: ObjectProperty
inverse of: is HeadQuarters Of
type: AsymmetricProperty
type: IrreflexiveProperty
domain: Organization
range: OP Place
comment: Indica il Place dove una Organization ha sede.
research results label: ha Sede in

has Item
type: ObjectProperty
sub property of: R7i is exemplified by
inverse of: is Item Of
domain: Edtion
range: OP Item
comment: Indica che una certa Edtion è esemplificata in una sua copia, cioè in un'OP_Item.
research results label: ha Copia

has Manifestation
type: ObjectProperty
sub property of: R4i is embodied in
inverse of: is Manifestation Of
domain: OP Expression
range: Edtion
comment: Indica che una certa OP_Expression è stata stampata in una Edition.
research results label: ha Pubblicazione

has Month
type: ObjectProperty
sub property of: has Date Specifics
inverse of: is Month Of
type: FunctionalProperty
domain: Date
range: Month
comment: Collega la Date di un certo evento con il Month in cui l'evento si è realizzato.
research results label: ha Mese

has Part
type: ObjectProperty
inverse of: isPartOf
type: TransitiveProperty
domain: Thing
range: Thing
comment: Proprietà generica che indica la relazione tutto-parte fra l'entità appartenente al dominio e quella appartenente al range.
research results label: ha Parte

has Part Expression
type: ObjectProperty
sub property of: R5 has component
sub property of: has Part
inverse of: is Part Of Expression
domain: OP Expression
range: OP Expression
comment: Indica la relazione tutto-parte fra una OP_Expression e una sua parte.
research results label: ha Parte di Redazione

has Part Manifestation
type: ObjectProperty
sub property of: R71 has part
sub property of: has Part
inverse of: is Part Of Manifestation
domain: Edtion
range: Edtion
comment: Indica la relazione tutto-parte fra una Edition e una sua parte strutturale che costituisce a sua volta una Edition, come un volume all'interno di una trilogia.
research results label: ha Volume in Pubblicazione

has Part Of Edition
type: ObjectProperty
inverse of: is Part Of Edition Of
type: AsymmetricProperty
type: IrreflexiveProperty
domain: OP Expression
range: Part Of Edition
comment: È una proprietà che lega un OP_Expression alla pubblicazione di una sua componente, della quale è possibile specificare per esempio l'intervallo di pagine.
research results label: ha Parte di Pubblicazione

has Part Work
type: ObjectProperty
sub property of: R67 has part
sub property of: has Part
inverse of: is Part Of Work
domain: Production
range: Production
comment: Indica il rapporto tutto-parte fra una Production e una Production che è una sua parte.
research results label: ha Parte di Opera

has Periodical
type: ObjectProperty
inverse of: is Periodical Of
type: AsymmetricProperty
type: IrreflexiveProperty
domain: Publishing House
range: Periodical
comment: Indica la relazione fra una PublishingHouse e un Periodical che costituisce una sua sotto-organizzazione.
research results label: possiede Periodico

has Physical Page
type: ObjectProperty
sub property of: P46 is composed of
sub property of: has Part
sub property of: hasPartTransitive
inverse of: is Physical Page Of
domain: Physical Draft
range: Physical Page
comment: Indica la relazione tutto-parte fra un PhysicalDraft e le PhysicalPage che lo compongono.
research results label: ha Pagina

has Receiver
type: ObjectProperty
inverse of: is Receiver Of
type: AsymmetricProperty
type: IrreflexiveProperty
domain: Letter
range: Class
  union of: Organization
  union of: Real Person
comment: Indica la RealPerson destinataria di una Letter.
research results label: ha Destinatario

has Sender
type: ObjectProperty
inverse of: is Sender Of
type: AsymmetricProperty
type: IrreflexiveProperty
domain: Letter
range: Real Person
comment: Indica la RealPerson che invia una Letter.
research results label: ha Mittente

has Supplied Creation Place
type: ObjectProperty
inverse of: is Supplied Creation Place Of
domain: Class
  union of: Edtion
  union of: OP Expression
  union of: Production
range: Real Place
comment: Proprietà corrispondente a hasCreationPlace quando il luogo di creazione è ricostruito da un curatore/editore.
research results label: ha Luogo Presunto di Creazione

has Supplied Day
type: ObjectProperty
sub property of: has Date Specifics
inverse of: is Supplied Day Of
type: FunctionalProperty
domain: Date
range: Day
comment: Collega la Date di un certo evento con il suo Day, nel caso in cui il giorno sia attribuito a un evento da un'entità esterna all'evento stesso. Per esempio, quando il giorno in cui è stata scritta un lettera è ricostruito da un curatore in mancanza dell'indicazione da parte dell'autore della lettera.
research results label: ha Giorno Presunto

has Supplied Month
type: ObjectProperty
sub property of: has Date Specifics
inverse of: is Supplied Month Of
type: FunctionalProperty
domain: Date
range: Month
comment: Collega la Date di un certo evento con il suo Month, nel caso in cui il mese sia attribuito a un evento da un'entità esterna all'evento stesso. Per esempio, quando il mese in cui è stata scritta un lettera è ricostruito da un curatore in mancanza dell'indicazione da parte dell'autore della lettera.
research results label: ha Mese Presunto

has Supplied Year
type: ObjectProperty
sub property of: has Date Specifics
inverse of: is Supplied Year Of
type: FunctionalProperty
domain: Date
range: Year
comment: Collega la Date di un certo evento con il suo Year, nel caso in cui l'anno sia attribuito a un evento da un'entità esterna all'evento stesso. Per esempio, quando l'anno in cui è stata scritta un lettera è ricostruito da un curatore in mancanza dell'indicazione da parte dell'autore della lettera.
research results label: ha Anno Presunto

has Symbolic Page Fragment
type: ObjectProperty
sub property of: R15 has fragment
sub property of: has Part
sub property of: hasPartTransitive
inverse of: is Symbolic Page Fragment Of
domain: OP Expression
range: Symbolic Page Fragment
comment: Indica la relazione tutto-parte fra un ExpressionDraft e i SymbolicPageFragment che lo compongono.
research results label: ha Porzione di Pagina Simbolica

has Translation
type: ObjectProperty
inverse of: is Translation Of
type: InverseFunctionalProperty
type: IrreflexiveProperty
domain: OP Expression
range: Translation
comment: Indica che una certa OP_Expression ha una certa Translation.
research results label: ha Traduzione

has Uncertain Creation Place
type: ObjectProperty
sub property of: has Supplied Creation Place
inverse of: is Uncertain Creation Place Of
domain: Class
  union of: Edtion
  union of: OP Expression
  union of: Production
range: Real Place
comment: Proprietà corrispondente a hasCreationPlace quando il luogo di creazione sia fornito da un curatore/editore con un basso grado di certezza.
research results label: ha Luogo Probabile di Creazione

has Uncertain Day
type: ObjectProperty
sub property of: has Supplied Day
inverse of: is Uncertain Day Of
domain: Date
range: Day
comment: Collega la Date di un certo evento con il suo Day, nel caso in cui il giorno sia attribuito a un evento da un'entità esterna all'evento stesso con una bassa certezza di attribuzione.
research results label: ha Giorno Probabile

has Uncertain Month
type: ObjectProperty
sub property of: has Supplied Month
inverse of: is Uncertain Month Of
domain: Date
range: Month
comment: Collega la Date di un certo evento con il suo Month, nel caso in cui il mese sia attribuito a un evento da un'entità esterna all'evento stesso con una bassa certezza di attribuzione.
research results label: ha Mese Probabile

has Uncertain Year
type: ObjectProperty
sub property of: has Supplied Year
inverse of: is Uncertain Year Of
domain: Date
range: Year
comment: Collega la Date di un certo evento con il suo Year, nel caso in cui l'anno sia attribuito a un evento da un'entità esterna all'evento stesso con una bassa certezza di attribuzione.
research results label: ha Anno Probabile

has Year
type: ObjectProperty
sub property of: has Date Specifics
inverse of: is Year Of
type: FunctionalProperty
domain: Date
range: Year
comment: Collega la Date di un certo evento con l'Year in cui l'evento si è realizzato.
research results label: ha Anno

is Archive Part Of
type: ObjectProperty
sub property of: isPartOf
sub property of: isPartOfTransitive
domain: RecordResource
range: RecordResource
comment: Inversa di hasArchivePart.
research results label: ha Parte Archivistica

is Author Of
type: ObjectProperty
domain: Author
range: Class
  union of: Edtion
  union of: OP Expression
  union of: Part Of Edition
  union of: Production
comment: Inversa di hasAuthor.
research results label: è Autore di

is Cited In
type: ObjectProperty
sub property of: is Mentioned In
domain: Class
  union of: Edtion
  union of: OP Expression
  union of: Part Of Edition
  union of: Production
range: Class
  union of: Edtion
  union of: OP Expression
  union of: Part Of Edition
  union of: Production
comment: Inversa di Cites.
research results label: è Citata in

is Creation Date From Of
type: ObjectProperty
sub property of: is Date Of
domain: Date
range: Class
  union of: Edtion
  union of: OP Expression
  union of: Production
comment: Inversa di hasCreationDateFrom.
research results label: è Data Iniziale di Creazione di

is Creation Date To Of
type: ObjectProperty
sub property of: is Date Of
domain: Date
range: Class
  union of: Edtion
  union of: OP Expression
  union of: Production
comment: Inversa di hasCreationDateTo.
research results label: è Data Finale di Creazione di

is Creation Place Of
type: ObjectProperty
domain: Real Place
range: Class
  union of: Edtion
  union of: OP Expression
  union of: Production
comment: Inversa di hasCreationPlace.
research results label: è Luogo di Creazione di

is Date Of
type: ObjectProperty
domain: Date
comment: Inversa di hasDate.
research results label: è Data di

is Day Of
type: ObjectProperty
sub property of: Date Specifics Of
domain: Day
range: Date
comment: Inversa di hasDay.
research results label: è Giorno di

is Digital Edition Of
type: ObjectProperty
comment: Inversa di hasDigitalEdition.
research results label: è Edizione Digitale di

is Editor Of
type: ObjectProperty
domain: Real Person
range: Edtion
comment: Inversa di hasEditor.
research results label: è Curatore di

is Expression Of
type: ObjectProperty
sub property of: R3i realises
domain: OP Expression
range: Production
comment: Inversa di hasExpression.
research results label: è Redazione di

is Family Member Of
type: ObjectProperty
sub property of: topObjectProperty
domain: Family Member
range: Family Member
comment: Inversa di hasFamilyMember
research results label: è Familiare di

is HeadQuarters Of
type: ObjectProperty
domain: OP Place
range: Organization
comment: Inversa di hasHeadQuartersIn.
research results label: è Sede di

is Item Of
type: ObjectProperty
sub property of: R7 exemplifies
domain: OP Item
range: Edtion
comment: Inversa di hasItem.
research results label: è Copia di

is Manifestation Of
type: ObjectProperty
sub property of: R4 embodies
domain: Edtion
range: OP Expression
comment: Inversa di hasManifestation.
research results label: è Pubblicazione di

is Mentioned In
type: ObjectProperty
domain: Class
  union of: Edtion
  union of: OP Expression
  union of: Part Of Edition
  union of: Production
range: Class
  union of: Edtion
  union of: OP Expression
  union of: Part Of Edition
  union of: Production
comment: Inversa di Mentions.
research results label: è Menzionata in

is Month Of
type: ObjectProperty
sub property of: Date Specifics Of
domain: Month
range: Date
comment: Inversa di hasMonth.
research results label: è Mese di

isPartOf
type: ObjectProperty
domain: Thing
range: Thing

is Part Of Edition Of
type: ObjectProperty
domain: Part Of Edition
range: OP Expression
comment: Inversa di hasPartOfEdtion.
research results label: è Parte Di Pubblicazione Di

is Part Of Expression
type: ObjectProperty
sub property of: R5i is component of
sub property of: isPartOf
domain: OP Expression
range: OP Expression
comment: Inversa di hasPartExpression.
research results label: è Parte di Redazione

is Part Of Manifestation
type: ObjectProperty
sub property of: R71i is part of
sub property of: isPartOf
domain: Edtion
range: Edtion
comment: Inversa di hasPartManifestation
research results label: è Volume in Pubblicazione di

is Part Of Work
type: ObjectProperty
sub property of: R67i forms part of
sub property of: isPartOf
domain: Production
range: Production
comment: Inversa di hasPartWork.
research results label: è Parte di Opera

is Periodical Of
type: ObjectProperty
domain: Periodical
range: Publishing House
comment: Inversa di hasPeriodical.
research results label: è Periodico Posseduto da

is Physical Page Of
type: ObjectProperty
sub property of: P46i forms part of
sub property of: isPartOf
sub property of: isPartOfTransitive
domain: Physical Page
range: Physical Draft
comment: Inversa di hasPhysicalPage.
research results label: è Pagina di

is Published By
type: ObjectProperty
domain: Edtion
range: Class
  union of: Periodical
  union of: Publishing House
comment: Inversa di Publish.
research results label: è Pubblicato da

is Receiver Of
type: ObjectProperty
domain: Class
  union of: Organization
  union of: Real Person
range: Letter
comment: Inversa di hasReceiver.
research results label: è Destinatario di

is Sender Of
type: ObjectProperty
domain: Real Person
range: Letter
comment: Inversa di hasSender.
research results label: è Mittente di

is Supplied Creation Place Of
type: ObjectProperty
domain: Real Place
range: Class
  union of: Edtion
  union of: OP Expression
  union of: Production
comment: Inversa di hasSuppliedCreationPlace.
research results label: è Luogo Presunto di Creazione di

is Supplied Day Of
type: ObjectProperty
sub property of: Date Specifics Of
domain: Day
range: Date
comment: Inversa di hasSuppliedDay.
research results label: è Giorno Presunto di

is Supplied Month Of
type: ObjectProperty
sub property of: Date Specifics Of
domain: Month
range: Date
comment: Inversa di HasSuppliedMonth. @en
research results label: è Mese Presunto di

is Supplied Year Of
type: ObjectProperty
sub property of: Date Specifics Of
domain: Year
range: Date
comment: Inversa di hasSuppliedYear.
research results label: è Anno Presunto di

is Symbolic Page Fragment Of
type: ObjectProperty
sub property of: R15i is fragment of
sub property of: isPartOf
sub property of: isPartOfTransitive
domain: Symbolic Page Fragment
range: OP Expression
comment: Inversa di hasSymbolicPageFragment.
research results label: è Porzione di Pagina Simbolica di

is Translation Of
type: ObjectProperty
domain: Translation
range: OP Expression
comment: Inversa di hasTranslation.
research results label: è Traduzione di

is Uncertain Creation Place Of
type: ObjectProperty
sub property of: is Supplied Creation Place Of
domain: Real Place
range: Class
  union of: Edtion
  union of: OP Expression
  union of: Production
comment: Inversa di hasUncertainCreationPlace.
research results label: è Luogo Probabile di Creazione di

is Uncertain Day Of
type: ObjectProperty
sub property of: is Supplied Day Of
domain: Day
range: Date
comment: Inversa di hasUncertainDay.
research results label: è Giorno Probabile di

is Uncertain Month Of
type: ObjectProperty
sub property of: is Supplied Month Of
domain: Month
range: Date
comment: Inversa di hasUncertainMonth.
research results label: è Mese Probabile di

is Uncertain Year Of
type: ObjectProperty
sub property of: is Supplied Year Of
domain: Year
range: Date
comment: Inversa di hasUncertainYear.
research results label: è Anno Probabile di

is Year Of
type: ObjectProperty
sub property of: Date Specifics Of
domain: Year
range: Date
comment: Inversa di hasYear.
research results label: è Anno di

OP Archive Identifier
type: DatatypeProperty
sub property of: identifier
domain: RecordResource
range: string
comment: Parola, numero, lettera, simbolo o una loro combinazione che identifica un'istanzza di una certa entità archivistica.
research results label: Identificatore d'Archivio

OP Folder Identifier
type: DatatypeProperty
sub property of: identifier
domain: Archive Folder
range: string
comment: Identificatore di un faldone d'archivio, completo delle informazioni su fondo, serie, sottoserie, ecc. Esempio: FE5I.16.
research results label: Identificatore Faldone Completo

OP has Archive Name
type: DatatypeProperty
sub property of: has Name
sub property of: name
domain: RecordResource
range: string
comment: Nome di un'entità d'archivio.
research results label: Nome d'Archvio

Fornisce l'indicazione delle carte occupate da un testimone all'interno di un faldone. Es.: 1r, 2r, 2v, 3r.
type: DatatypeProperty
sub property of: recordResourceExtent
domain: RecordResource
range: string
label: OP record Resource Extent @en
research results label: Carte nel Faldone

has Abbreviation
type: DatatypeProperty
domain: Edtion
range: string
comment: Abbreviazione di una Edition nel file di informazioni bibliografiche redatto da Eliana Vitale.
research results label: ha Abbreviazione

has Abstract
type: DatatypeProperty
domain: Class
  union of: Edtion
  union of: OP Expression
  union of: Part Of Edition
  union of: Production
range: string
comment: Riporta il contenuto sintetico di un'opera.
research results label: ha Abstract

has Archive Page Number
type: DatatypeProperty
domain: Physical Page
range: string
comment: Indica la segnatura di archivio di una certa PhysicalPage. Es.: 41r 3v
research results label: ha Numero di Pagina d'Archivio

has Description
type: DatatypeProperty
domain: Class
  union of: Edtion
  union of: OP Expression
  union of: Part Of Edition
  union of: Production
range: string
comment: Etichetta descrittiva dell'argomento in bibliografia secondaria.
research results label: ha Descrizione

has Edition Link
type: DatatypeProperty
sub property of: has File Link
domain: OP Expression
comment: Riporta il link all'edizione sul portale PAVES-e.
research results label: ha Link a Edizione

has Editorial Series
type: DatatypeProperty
domain: Edtion
range: string
comment: Riporta in nome della collana editoriale cui appartiene una certa Edition.
research results label: ha Collana Editoriale

has File Link
type: DatatypeProperty
domain: Thing
comment: Riporta l'iri di un file.
research results label: ha Link a File

has Image
type: DatatypeProperty
domain: Physical Page
range: string
comment: Riporta l'indirizzo del file immagine di una certa PhysicalPage
research results label: ha Immagine

has Int Value
type: DatatypeProperty
domain: Thing
range: int
comment: Un valore intero, per esempio per un Day, di un Month, di un Year, per esempio.
research results label: ha Valore Intero

has Issue Number
type: DatatypeProperty
domain: Periodical Issue
range: string
comment: Riporta il numero di un certo PeriodicalIssue.
research results label: ha Numero di Fascicolo

has Language
type: DatatypeProperty
sub property of: language
domain: Class
  union of: Edtion
  union of: OP Expression
  union of: Part Of Edition
  union of: Production
range: language
comment: Indica la lingua in cui è stata realizzata un'opera, che si tratti di una Production, un'OP_Expression, ecc.
research results label: ha Lingua

has Name
type: DatatypeProperty
domain: Thing
range: string
comment: Proprietà generica per le denominazioni di individui (a eccezione delle opere, per i quali si usa hasTitle).
research results label: ha Nome

Note
type: DatatypeProperty
domain: Thing
range: string
comment: Riporta informazioni supplementari di vario genere.
research results label: Nota

has Organization Name
type: DatatypeProperty
sub property of: has Name
domain: Organization
range: string
comment: Riporta il nome di una Organization.
research results label: ha Nome

has Page Number Span
type: DatatypeProperty
domain: Part Of Edition
range: string
comment: Indica, ove disponibile, l'intervallo di pagine occupato da una PartOfEdition in una Edition, in numeri arabi o romani. Il formato è CIFRA1-CIFRA2. Es: I-IX 3-45
research results label: ha Intervallo di Pagine

has Person Name
type: DatatypeProperty
sub property of: has Name
domain: OP Person
range: string
comment: Riporta il nome di battesimo di una Person. Nel caso in cui la Person sia generalmente nota con più nomi (per es. Bret Easton Ellis), si riportano tutti i nomi in un unico valore della proprietà. De i nomi aggiuntivi dopo il primo non sono generalmente utilizzati per designare la Person, non si riportano. Per i nomi romani, riporta il solo praenomen, mentre nomen e cognomen usano la proprietà hasSurname
research results label: ha Nome

has Place Name
type: DatatypeProperty
sub property of: has Name
domain: OP Place
range: string
comment: Riporta il nome con cui è noto un Place.
research results label: ha Nome

has Print Lenght
type: DatatypeProperty
domain: Edtion
range: string
comment: Indica la lunghezza di una Edition. Di norma è espresso in numeri arabi (es.: 120) o in una combinazione di numeri romani e arabi, per tenere conto delle pagine introduttive (es.: XVI-130).
research results label: ha Lunghezza di Stampa

has Pseudonym
type: DatatypeProperty
sub property of: has Name
domain: OP Person
range: string
comment: Riporta lo pseudonimo con cui è nota una Person. Nel caso di Alberto Pincherle, ad esempio, avrà valore "Alberto Moravia".
research results label: ha Pseudonimo @en

has Section Name
type: DatatypeProperty
sub property of: has Name
domain: Part Of Edition
range: string
comment: Indica il nome della sezione di un libro all'interno della quale ricade una certa PartOfEdition.
research results label: ha Nome di Sezione

has Surname
type: DatatypeProperty
sub property of: has Name
type: FunctionalProperty
domain: OP Person
range: string
comment: Riporta il cognome di una Person. Nel caso di cognomi multipli, ci si comporta come per hasPersonName. Nel caso di nomi romani, riporta insieme nomen e cognomen (per il praenomen si usa hasPersonName).
research results label: ha Cognome

has Title
type: DatatypeProperty
sub property of: topDataProperty
domain: Class
  union of: Edtion
  union of: OP Expression
  union of: Part Of Edition
  union of: Production
range: string
comment: Indica il titolo di una Production, OP_Expression, Edition o PartOfEdition.
research results label: ha Titolo

has Title Translation
type: DatatypeProperty
sub property of: topDataProperty
domain: Production
range: string
comment: Riporta il titolo italiano con cui è generalmente nota una Production in lingua straniera.
research results label: ha Titolo Italiano

has Volume Number
type: DatatypeProperty
domain: Edtion
range: string
comment: Indica il numero di volume in cui sono stati raccolti i fascicoli di una rivista, o il numero di volume di un'opera in più volumi.
research results label: ha Numero di Volume

has Witness Number
type: DatatypeProperty
domain: Witness
range: string
comment: Indica il numero progressivo della stesura manoscritta di una certa opera (ad esempio: 1). Si noti che nel caso fra una stesura manoscritta e la seguente ve ne sia una dattiloscritta intermedia, la numerazione ne tiene conto saltando all’intero successivo (es: 1, 2, 4).
research results label: ha Numero di Testimone Manoscritto

lrmoo:F11_Corporate_Body
type: Class
comment: This class comprises organisations and groups of two or more people and/or organisations acting as a unit. To be considered an instance of F11 Corporate Body a gathering of people needs to bear a name and exhibit organisational characteristics sufficient to allow the body as a whole to participate in the creation, modification or production of an E73 Information Object. Groups such as conferences, congresses, expeditions, exhibitions, festivals, fairs, etc. are modelled as F11 Corporate Bodies when they are named and can take collective action, such as approving a report or publishing their proceedings. @en

lrmoo:F1_Work
type: Class
comment: This class comprises distinct intellectual ideas conveyed in artistic and intellectual creations, such a poems, stories or musical compositions. A Work is the outcome of an intellectual process of one or more persons. Inherent to the notion of work is the existence of recognisable realizations of the work in the form of one or more expressions. Works are often regarded as finished and discrete e.g. when declared as such by the creator of the work or based on the elaboration or logical coherence of its content. However, works may be recognized as existing but unfinished e.g. if the creators deliberately or accidentally never explicitly finished a particular Expression but have left behind partial expressions. In the absence of explicit information about the initial conception, which is rarely available, the first expression created constitutes witness of the beginning of existence of a Work. A Work can evolve over time, such as through revised editions. A Work may be elaborated by one or more Actors simultaneously, in parallel, or over time. Additional expressions of a Work can continue to be created over time. The boundaries of a Work have nothing to do with the value of the intellectual achievement but only with the dominance of a concept. The main purpose of this class is to enable bringing together intellectually equivalent Expressions in order to display to a user all available alternatives of the same intellectual or artistic content. @en

lrmoo:F3_Manifestation
type: Class
comment: This class comprises products rendering one or more Expressions. A Manifestation is defined by both the overall content and the form of its presentation. The substance of F3 Manifestation is not only signs, but also the manner in which they are presented to be consumed by users, including the kind of media adopted. An F3 Manifestation is the outcome of a publication process where one or more F2 Expressions are prepared for public dissemination, but it may also be a unique form created directly on some material carrier without the intent of being formally published. An instance of F3 Manifestation typically incorporates one or more instances of F2 Expression representing a distinct logical content and all additional input by a publisher such as text layout and cover design. Additionally an F3 Manifestation can be identified by the physical features for the medium of distribution, if applicable. For example, publications in the form of hard-cover and paperback editions would be two distinct instances of F3 Manifestation, even though authorial and editorial content are otherwise identical in both publications. In the case of industrial products such as printed books or music CDs, but also digital material, an instance of F3 Manifestation can be regarded as the prototype for all copies of it. In these cases, an instance of F3 Manifestation specifies all of the features or traits that instances of F5 Item display in order to be copies of a particular publication. In the case of industrial products, instances of F3 Manifestation are also instances of E99 Product Type, normally nowadays identified by characteristic identifiers such as ISBN numbers. @en

F5 Item
type: Class
comment: Un oggetto fisico che è un'istanza di una Edition (ad esempio una certa copia di un Book), o la materializzazione di una certa OP_Expression (ad esempio un manoscritto).

cidoc-crm:E21_Person
type: Class
comment: This class comprises real persons who live or are assumed to have lived. Legendary figures that may have existed, such as Ulysses and King Arthur, fall into this class if the documentation refers to them as historical figures. In cases where doubt exists as to whether several persons are in fact identical, multiple instances can be created and linked to indicate their relationship. The CIDOC CRM does not propose a specific form to support reasoning about possible identity. In a bibliographic context, a name presented following the conventions usually employed for personal names will be assumed to correspond to an actual real person (an instance of E21 Person), unless evidence is available to indicate that this is not the case. The fact that a persona may erroneously be classified as an instance of E21 Person does not imply that the concept comprises personae. @en

cidoc-crm:E53_Place
type: Class
comment: This class comprises extents in the natural space where people live, in particular on the surface of the Earth, in the pure sense of physics: independent from temporal phenomena and matter. They may serve describing the physical location of things or phenomena or other areas of interest. Geometrically, instances of E53 Place constitute single contiguous areas or a finite aggregation of disjoint areas in space which are each individually contiguous. They may have fuzzy boundaries. The instances of E53 Place are usually determined by reference to the position of “immobile” objects such as buildings, cities, mountains, rivers, or dedicated geodetic marks, but may also be determined by reference to mobile objects. A Place can be determined by combining a frame of reference and a location with respect to this frame. It is sometimes argued that instances of E53 Place are best identified by global coordinates or absolute reference systems. However, relative references are often more relevant in the context of cultural documentation and tend to be more precise. In particular, people are often interested in position in relation to large, mobile objects, such as ships. For example, the Place at which Nelson died is known with reference to a large mobile object, i.e. H.M.S Victory. A resolution of this Place in terms of absolute coordinates would require knowledge of the movements of the vessel and the precise time of death, either of which may be revised, and the result would lack historical and cultural relevance. Any instance of E18 Physical Thing can serve as a frame of reference for an instance of E53 Place. This may be documented using the property P157 is at rest relative to (provides reference space for). @en

Archive
type: Class
subclass of: RecordSet
comment: Un archivio.
research results label: Archivio

Archive Collection
type: Class
subclass of: RecordSet
comment: Un fondo archivistico.
research results label: Fondo Archivistico

Archive Folder
type: Class
subclass of: Record
comment: Un faldone o un fascicolo all'interno di un fondo, di un sottofondo, di una serie archivistica.
research results label: Faldone d'Archivio

Archive Series
type: Class
subclass of: RecordSet
comment: Una serie all'interno di un fondo o di un sottofondo archivistico.
research results label: Serie d'Archivio

Archive SubCollection
type: Class
subclass of: RecordSet
comment: Un sottofondo di un fondo archivistico.
research results label: Sottofondo d'Archivio

Archive SubSeries
type: Class
subclass of: RecordSet
comment: Una sottoserie all'interno di una serie archivistica.
research results label: Sottoserie d'Archivio

Author
type: Class
equivalent class: Class
  union of: Restriction
    on property: is Author Of
    some values from: Edtion
  union of: Restriction
    on property: is Author Of
    some values from: OP Expression
  union of: Restriction
    on property: is Author Of
    some values from: Part Of Edition
  union of: Restriction
    on property: is Author Of
    some values from: Production
subclass of: Real Person
comment: L'autore di un'opera di ingegno.
research results label: Autore

Book
type: Class
equivalent class: Restriction
  on property: is Published By
  some values from: Publishing House
subclass of: Edtion
comment: Una pubblicazione che ha la forma di un libro.
research results label: Libro

Century
type: Class
subclass of: Date Specifics
comment: Indica un secolo o un intervallo di secoli, in numeri romani. Il valore si indica con la dataproperty hasStringValue. Inserita solo per i casi in cui non sia disponibile informazione più specifica. Se necessario, si aggiunge l'indicazione a.C. Es.: XIX II a.C. - I a.C. I a.C. - V
research results label: Secolo

Collection
type: Class
equivalent class: Restriction
  on property: has Part Work
  min qualified cardinality: 2
  on class: Production
subclass of: Creative Work
comment: Una raccolta di Production distinte, anche senza nessun carattere in comune (una lettera e una poesia). Si riferisce anche all'operazione intellettuale di scegliere e ordinare le Production in questione.
research results label: Raccolta

Creative Work
type: Class
subclass of: Literary Work
disjoint with: Essay
comment: Un'opera letteraria creativa, definita principalmente attraverso il suo complemento, ossia le opere saggistiche.
research results label: Opera Creativa

Date
type: Class
comment: Un istante più o meno ben individuato nel tempo. La precisione va dal giorno al secolo.
research results label: Data

Date Specifics
type: Class
comment: Classe che include i componenti di una data.
research results label: Componenti della Data

Day
type: Class
subclass of: Date Specifics
comment: Un certo giorno secondo il calendario gregoriano. Il valore si indica con la data property hasIntValue.
research results label: Giorno

Dialog Collection
type: Class
equivalent class: Restriction
  on property: has Part Work
  min qualified cardinality: 2
  on class: Dialogue
subclass of: Collection
comment: Una raccolta di Dialog. Si riferisce anche all'operazione intellettuale di scegliere e ordinare i Dialog in questione.
research results label: Raccolta di Dialoghi

Dialogue
type: Class
subclass of: Creative Work
comment: Un'opera letteraria nella forma (quanto meno prevalente) del dialogo.
research results label: Dialogo

Diary
type: Class
equivalent class: Restriction
  on property: has Part Work
  min qualified cardinality: 2
  on class: Journal Entry
subclass of: Collection
comment: Una raccolta di JournalEntry. Si riferisce anche all'operazione intellettuale di scegliere e ordinare le JournalEntry in questione.
research results label: Diario

Digital Edition
type: Class
comment: Classe che include edizioni digitali.
research results label: Edizione Digitale

Drama
type: Class
subclass of: Creative Work
comment: Un'opera destinata alla rappresentazione scenica.
research results label: Opera Drammaturgica

Edtion
type: Class
equivalent class: Restriction
  on property: is Manifestation Of
  some values from: OP Expression
subclass of: lrmoo:F3_Manifestation
comment: La rappresentazione, in forma e contenuto, di una o più Expression, veicolate in una pubblicazione.
research results label: Pubblicazione

Essay
type: Class
subclass of: Literary Work
comment: Un saggio o un articolo scritto, frutto dello studio di un certo tema.
research results label: Saggio

Essay Collection
type: Class
equivalent class: Restriction
  on property: has Part Work
  min qualified cardinality: 2
  on class: Essay
subclass of: Collection
comment: Una raccolta di Essay. Si riferisce anche all'operazione intellettuale di scegliere e ordinaregli Essay in questione.
research results label: Raccolta di Saggi

Expression Chapter
type: Class
subclass of: OP Expression
comment: Un capitolo o una sezione all'interno di un'opera, solitamente indicato con un titolo o un numero progressivo. La proprietà isPartOfExpression lo lega alla OP_Expression di cui è parte.
research results label: Capitolo

Family Member
type: Class
equivalent class: Restriction
  on property: is Family Member Of
  some values from: Real Person
subclass of: Real Person
comment: Un parente di una RealPerson.
research results label: Familiare

Fiction
type: Class
subclass of: Creative Work
comment: Un'opera di finzione in prosa, distinta dall'opera teatrale e dal dialogo.
research results label: Narrativa

Fictional Person
type: Class
subclass of: OP Person
comment: Un personaggio d'invenzione. NB: Una persona reale che compaia come personaggio (per esempio di un racconto) viene rappresentata attraverso due individui: la RealPerson e la FictionalPerson.
research results label: Personaggio

Fictional Place
type: Class
subclass of: OP Place
comment: Un luogo di fantasia. NB: Quando un luogo reale figura in un racconto, viene rappresentato con due individui, un RealPlace e un FictionalPlace.
research results label: Luogo Immaginario

Journal Entry
type: Class
subclass of: Personal Text
comment: Una annotazione su un diario, di solito individuabile attraverso la data che la accompagna.
research results label: Voce di Diario

Letter
type: Class
subclass of: Personal Text
comment: Una comunicazione scritta diretta a una o più persone nell’ambito di rapporti privati o di ufficio.
research results label: Lettera

Letter Collection
type: Class
equivalent class: Restriction
  on property: has Part Work
  min qualified cardinality: 2
  on class: Letter
subclass of: Collection
comment: Una raccolta di Letter. Si riferisce anche all'operazione intellettuale di scegliere e ordinare le Letter in questione.
research results label: Raccolta di Lettere

Literary Work
type: Class
subclass of: Production
disjoint with: Personal Text
comment: Un'opera concepita con intenti letterari o artistici, destinata dunque a un pubblico.
research results label: Opera Letteraria

Month
type: Class
subclass of: Date Specifics
comment: Un certo mese secondo il calendario gregoriano. Il valore si indica con la data property hasIntValue.
research results label: Mese

Novel
type: Class
subclass of: Fiction
disjoint with: Short Story
comment: Un romanzo.
research results label: Romanzo

Novel Collection
type: Class
equivalent class: Restriction
  on property: has Part Work
  min qualified cardinality: 2
  on class: Novel
subclass of: Collection
comment: Una raccolta di Novel. Si riferisce anche all'operazione intellettuale di scegliere e ordinare le Novel in questione.
research results label: Raccolta di Romanzi

OP Expression
type: Class
subclass of: F2 Expression
comment: La realizzazione artistica o intellettuale di una Production, sotto la forma di un testo. La sostanza di OP_Expression sono i segni.
research results label: Redazione

OP Item
type: Class
subclass of: F5 Item
comment: Un esemplare fisico di una certa edizione di un'opera, o anche un manoscritto.
research results label: Esemplare

OP Person
type: Class
comment: Una persona, che sia realmente esistita o meno.
research results label: Persona

Organization
type: Class
subclass of: lrmoo:F11_Corporate_Body
comment: Un ente pubblico o privato di qualunque genere. Es.: Il Comune di Torino. Il Partito Comunista Italiano. La casa editrice Einaudi. Il periodico L'Espresso.
research results label: Organizzazione

Part Of Edition
type: Class
equivalent class: Restriction
  on property: is Part Of Edition Of
  some values from: OP Expression
comment: La porzione di una Edition che rappresenta una certa Expression.
research results label: Parte di Pubblicazione

Periodical
type: Class
equivalent class: Class
  union of: Restriction
    on property: Publish
    some values from: Periodical Issue
  union of: Restriction
    on property: is Periodical Of
    some values from: Publishing House
subclass of: Organization
comment: Un periodico, qui inteso come l'organizzazione che presiede alla realizzazione e alla pubblicazione di una rivista o di un quotidicano.
research results label: Periodico

Periodical Issue
type: Class
equivalent class: Restriction
  on property: is Published By
  some values from: Periodical
subclass of: Edtion
comment: Una pubblicazione che ha la forma di un numero o fascolo di un certo periodico.
research results label: Numero di Periodico

Personal Text
type: Class
subclass of: Production
comment: Un testo concepito, almeno inizialmente, a uso privato.
research results label: Testo Privato

Physical Draft
type: Class
equivalent class: Class
  union of: Restriction
    on property: OP isInstantiationOf
    some values from: Witness
  union of: Restriction
    on property: has Physical Page
    some values from: Physical Page
subclass of: OP Item
subclass of: Instantiation
comment: L'oggetto fisico che rappresenta la stesura di una Production (una lettera, un manoscritto).
research results label: Manoscritto

Physical Page
type: Class
equivalent class: Class
  union of: Restriction
    on property: OP isInstantiationOf
    some values from: Symbolic Page Fragment
  union of: Restriction
    on property: is Physical Page Of
    some values from: Physical Draft
subclass of: E24 Physical Human-Made Thing
subclass of: Instantiation
comment: Una pagina fisica di un documento. Per "pagina" si intende una delle due facce di un foglio di carta. Es.: un manoscritto o un dattiloscritto recante la stesura di un'opera o di una lettera.
research results label: Pagina

Poem
type: Class
subclass of: Creative Work
comment: Una poesia o un poema.
research results label: Poesia

Poetry Collection
type: Class
equivalent class: Restriction
  on property: has Part Work
  min qualified cardinality: 2
  on class: Poem
subclass of: Collection
comment: Una raccolta di Poem. Si riferisce anche all'operazione intellettuale di scegliere e ordinare le Poetry in questione.
research results label: Raccolta di Poesie

Poetry Translation
type: Class
subclass of: Translation
comment: La traduzione di un testo in versi.
research results label: Traduzione di Poesia

Production
type: Class
subclass of: lrmoo:F1_Work
comment: Il risultato astratto di un processo intellettuale, poi comunicato nella forma di un'opera artistica o dell'ingegno e veicolata da un testo.
research results label: Opera

Prose Drama
type: Class
subclass of: Drama
comment: Un'opera teatrale in prosa.
research results label: Opera Drammaturgica in Prosa

Prose Translation
type: Class
subclass of: Translation
comment: La traduzione di un testo in prosa.
research results label: Traduzione di Testo in Prosa

Publishing House
type: Class
equivalent class: Class
  union of: Restriction
    on property: Publish
    some values from: Book
  union of: Restriction
    on property: has Periodical
    some values from: Periodical
subclass of: Organization
comment: Una casa editrice.
research results label: Casa Editrice

Real Person
type: Class
subclass of: cidoc-crm:E21_Person
subclass of: OP Person
comment: Una persona realmente esistita.
research results label: Persona Reale

Real Place
type: Class
subclass of: cidoc-crm:E53_Place
subclass of: OP Place
comment: Un luogo realmente esistente.
research results label: Luogo Reale

Short Story
type: Class
subclass of: Fiction
comment: Un racconto o una novella.
research results label: Racconto

Short Story Collection
type: Class
equivalent class: Restriction
  on property: has Part Work
  min qualified cardinality: 2
  on class: Short Story
subclass of: Collection
comment: Una raccolta di ShortStory. Si riferisce anche all'operazione intellettuale di scegliere e ordinare le ShortStory in questione.
research results label: Raccolta di Racconti

Symbolic Page Fragment
type: Class
equivalent class: Class
  union of: Restriction
    on property: OP has Instantiation
    some values from: Physical Page
  union of: Restriction
    on property: is Symbolic Page Fragment Of
    some values from: Witness
subclass of: E33 Linguistic Object
subclass of: RecordPart
comment: Il contenuto intellettuale di una parte di una pagina appartenente a un documento (o della pagina nella sua interezza). Per "contenuto intellettuale" si intende un'astrazione che comprende il testo scritto, la particolare grafia o il carattere scelto, lo strumento usato, lo specchio di scrittura, e in genere tutta l'informazione che la pagina fisica veicola.
research results label: Porzione di Pagina Simbolica

Translation
type: Class
equivalent class: Restriction
  on property: is Translation Of
  some values from: OP Expression
subclass of: OP Expression
comment: La traduzione di un testo.
research results label: Traduzione

Verse Drama
type: Class
subclass of: Drama
comment: Un'opera teatrale in versi.
research results label: Opera Drammaturgica in Versi

Witness
type: Class
equivalent class: Restriction
  on property: OP has Instantiation
  some values from: Physical Draft
subclass of: OP Expression
subclass of: RecordPart
comment: Un Witness che riporta una stesura di una Production.
research results label: Testimone Manoscritto

Year
type: Class
subclass of: Date Specifics
comment: Un certo anno secondo il calendario gregoriano. Il valore si indica con la data property hasIntValue.
research results label: Anno

Restriction
on property: has Part
has self: true
subclass of: Nothing